ELECTION,OFFICECD,CANDID,CANCLASS,CANDLAST,CANDFIRST,CANDMI,COMMITTEE,FILING,SCHEDULE,PAGENO,SEQUENCENO,REFNO,INV_DATE,DATE,NAME,C_CODE,ORG_IND,STRNO,STRNAME,APARTMENT,CITY,STATE,ZIP,PAY_METHOD,AMNT,PURPOSECD,PURPOSE,EXPLAIN,EXEMPTCD,RR_IND,SEG_IND
2003,5,353,P,Rodriguez,Ydanis,A,I,6,F,,,R0001366,7/24/2003 00:00:00,7/24/2003 00:00:00,1 Sickles Street Company,CORP,Y,1841,Broadway,1000,New York,NY,10023,Final,8000.00,RENTO,Office Rent,Rent in advance,,N,N
2003,5,353,P,Rodriguez,Ydanis,A,I,11,L,,,R0002018,7/24/2003 00:00:00,12/31/2003 00:00:00,1 Sickles Street Company,CORP,Y,1841,Broadway,1000,New York,NY,10023,,-1835.00,,,,,N,N
2003,5,527,P,Fidler,Lewis,A,I,10,F,,,R0001344,10/24/2003 00:00:00,10/24/2003 00:00:00,102 W. ASSOCIATION LLC,ORG,Y,180,CABRINI BLVD.,,NEW YORK,NY,10033,Final,350.00,OTHER,Other: explntion,PETTY CASH,,N,N
2003,5,420,P,Comrie,Leroy,G,J,4,F,,,R0001654,4/12/2003 00:00:00,4/12/2003 00:00:00,103RD PRECINCT COMM.COUNCIL,OTHR,Y,,,,,,,Final,100.00,CONSV,Constituent Svcs,TKTS. COMM. EVENT,,N,N
2003,5,264,P,Katz,Melinda,R,L,1,F,,,R0000844,5/8/2002 00:00:00,5/8/2002 00:00:00,107TH PRECINCT COMMUNITY COUNC,ORG,Y,158-39,H.V.A. JR AVENUE,,QUEENS,NY,11365,Final,40.00,OTHER,Other: explntion,DINNER DANCE,,N,N
2003,5,AI,P,"Ruiz, Jr.",Israel,,I,7,F,,,R0001260,8/27/2003 00:00:00,8/27/2003 00:00:00,111 WASHINGTON STREET PARKING,ORG,Y,111,WASHINGTON ST,,NEW YORK,NY,10016,Final,15.00,OTHER,Other: explntion,PARKING-NYCCFB,,N,N
2003,5,AI,P,"Ruiz, Jr.",Israel,,I,6,F,,,R0001042,8/7/2003 00:00:00,8/7/2003 00:00:00,111 WASHINGTON STREET PARKING,ORG,Y,111,WASHINGTON ST,,NEW YORK,NY,10016,Final,12.00,OTHER,Other: explntion,PARKING-NYCCFB,,N,N
2003,5,762,P,Reddick,Yvonne,,H,7,F,,,R0000780,9/4/2003 00:00:00,9/4/2003 00:00:00,1199 SEIU,ORG,Y,310,WESTN 43RD STREET,,NEW YORK,NY,10036,Final,667.00,OFFCE,Office Expenses,THANK YOU LETTERS,,N,N
2003,5,767,P,Palma,Annabel,,H,7,F,,,R0001636,9/11/2003 00:00:00,9/11/2003 00:00:00,1199 SEIU POL ACTION FUNDS,PCOMP,Y,310,WEST 43RD STREET,,New York,NY,10036,Final,4013.00,PROFL,Prof. Srvcs.,"voice calls 9/8,eday",,N,N
2003,5,767,P,Palma,Annabel,,H,7,F,,,R0001640,9/8/2003 00:00:00,9/9/2003 00:00:00,1199 SEIU POL ACTION FUNDS,PCOMP,Y,310,WEST 43RD STREET,,New York,NY,10036,Final,3200.00,PROFL,Prof. Srvcs.,data entry services,,N,N
2003,5,767,P,Palma,Annabel,,H,6,F,,,R0001562,8/8/2003 00:00:00,8/24/2003 00:00:00,1199 SEIU POL ACTION FUNDS,PCOMP,Y,310,WEST 43RD STREET,,New York,NY,10036,Final,3146.00,PETIT,Petition Expns.,signature data entry,P,N,N
2003,5,767,P,Palma,Annabel,,H,11,N,,,R0001167,,7/11/2003 00:00:00,1199 SEIU POL ACTION FUNDS,PCOMP,Y,310,WEST 43RD STREET,,New York,NY,10036,,500.00,RENTO,Office Rent,RENT/COPYING,,N,N
2003,5,767,P,Palma,Annabel,,H,11,N,,,R0001811,,9/5/2003 00:00:00,1199 SEIU POL ACTION FUNDS,PCOMP,Y,310,WEST 43RD STREET,,New York,NY,10036,,2736.00,PROFL,Prof. Srvcs.,voice blasts,,N,N
2003,5,767,P,Palma,Annabel,,H,11,N,,,R0001990,,10/17/2003 00:00:00,1199 SEIU POL ACTION FUNDS,PCOMP,Y,310,WEST 43RD STREET,,New York,NY,10036,,454.00,PROFL,Prof. Srvcs.,Phone Banking,,N,N
2003,5,767,P,Palma,Annabel,,H,11,N,,,R0001999,,9/5/2003 00:00:00,1199 SEIU POL ACTION FUNDS,PCOMP,Y,310,WEST 43RD STREET,,New York,NY,10036,,2736.00,PROFL,Prof. Srvcs.,Phone Banking,,N,N
2003,5,767,P,Palma,Annabel,,H,11,N,,,R0001988,,11/7/2003 00:00:00,1199 SEIU POL ACTION FUNDS,PCOMP,Y,310,WEST 43RD STREET,,New York,NY,10036,,2975.00,PROFL,Prof. Srvcs.,Phone Banking,,N,N
2003,5,767,P,Palma,Annabel,,H,11,N,,,R0001778,,9/16/2003 00:00:00,1199 SEIU POL ACTION FUNDS,PCOMP,Y,310,WEST 43RD STREET,,New York,NY,10036,,13172.00,OTHER,Other: explntion,HRC Palm Card/Wrkrs,,N,N
2003,5,490,P,Taitt,Samuel,A,I,7,F,,,R0001834,9/9/2003 00:00:00,9/9/2003 00:00:00,1600 WWRL,CORP,Y,41-30,58TH ST.,,QUEENS,NY,11377,Final,900.00,RADIO,Radio Ads.,radio ads,,N,N
2003,5,717,P,Gentile,Vincent,J,J,8,F,,,R0001036,9/24/2003 00:00:00,9/24/2003 00:00:00,17 MURRAY,ORG,Y,17,MURRAY STREET,,NEW YORK,NY,10007,Final,400.00,FUNDR,Fundraising,FUNDRAISER,,N,N
2003,5,452,P,Reyna,Diana,,H,6,F,,,R0000954,8/6/2003 00:00:00,8/6/2003 00:00:00,17 MURRAY,ORG,Y,17,MURRAY STREET,,NEW YORK,NY,10007,Final,1200.00,FUNDR,Fundraising,CATERING,,N,N
2003,5,527,P,Fidler,Lewis,A,I,4,F,,,R0001052,4/30/2003 00:00:00,4/30/2003 00:00:00,17 MURRAY,ORG,Y,17,MURRAY STREET,,NEW YORK,NY,10007,Final,2300.00,FUNDR,Fundraising,MANH FR,,N,N
2003,5,717,P,Gentile,Vincent,J,J,4,F,,,R0000594,6/25/2003 00:00:00,6/25/2003 00:00:00,17 MURRAY,ORG,Y,17,MURRAY STREET,,NEW YORK,NY,10007,Final,625.00,FUNDR,Fundraising,FUNDRAISER,,N,N
2003,5,717,P,Gentile,Vincent,J,J,4,F,,,R0000704,5/16/2003 00:00:00,7/10/2003 00:00:00,17 MURRAY,ORG,Y,17,MURRAY STREET,,NEW YORK,NY,10007,Final,554.00,OFFCE,Office Expenses,MONTHLY TELEPHONE,,N,N
2003,5,271,P,McMahon,Michael,E,J,1,F,,,R0000184,5/15/2002 00:00:00,5/15/2002 00:00:00,17 MURRAY REST.& BAR,ORG,Y,17,MURRAY STREET,,NEW YORK,NY,10007,Final,100.00,FUNDR,Fundraising,GRATUITIES,,N,N
2003,5,271,P,McMahon,Michael,E,J,1,F,,,R0000153,5/15/2002 00:00:00,5/15/2002 00:00:00,17 MURRAY REST.& BAR,ORG,Y,17,MURRAY STREET,,NEW YORK,NY,10007,Final,1280.00,FUNDR,Fundraising,FOOD COST,,N,N
2003,5,AI,P,"Ruiz, Jr.",Israel,,I,7,F,,,R0001299,9/2/2003 00:00:00,9/2/2003 00:00:00,17 MURRAY RESTAURANT,ORG,Y,17,MURRAY STREET,,NEW YORK,NY,10017,Final,141.00,OTHER,Other: explntion,PRESS CONFERENCE-LUN,,N,N
2003,5,HF,P,Addabbo,Joseph,P,I,10,F,,,R0001589,10/21/2003 00:00:00,10/21/2003 00:00:00,17 MURRAY RESTAURANT & BAR,ORG,Y,17,MURRAY STREET,,NEW YORK,NY,10007,Final,900.00,FUNDR,Fundraising,FUNDRAISER,,N,N
2003,5,420,P,Comrie,Leroy,G,J,2,F,,,R0000651,6/25/2002 00:00:00,7/3/2002 00:00:00,17 MURRAY STREET,CORP,Y,17,MURRAY STREET,,New York,NY,10013,Final,1578.00,FUNDR,Fundraising,FUNDRAISING EVENT,,N,N
2003,5,272,P,Monserrate,Hiram,,J,2,F,,,R0000319,12/19/2002 00:00:00,12/19/2002 00:00:00,17 MURRAY STREET RESTAURANT,ORG,Y,17,MURRAY STREET,,NEW YORK,NY,10007,Final,1768.00,FUNDR,Fundraising,FUNDRAISER-11/14/02,,N,N
2003,5,283,P,Gennaro,James,F,I,4,F,,,R0002005,4/22/2003 00:00:00,5/25/2003 00:00:00,17 Murray Street Restaurant,CORP,Y,17,Murray Street,,New York,NY,10007,Final,38.00,CONSL,Campgn Consuls.,food for meeting,,N,N
2003,5,763,P,Gleason,Peter,J,H,4,F,,,R0000262,6/20/2003 00:00:00,6/20/2003 00:00:00,1ST PCT. COMMUNITY COUNCIL,ORG,Y,,,,,,,Final,150.00,OTHER,Other: explntion,LUNCH EVENT,,N,N
2003,5,326,P,de Blasio,Bill,,J,4,F,,,R0001681,1/8/2003 00:00:00,1/28/2003 00:00:00,200 5th,CORP,Y,200,5th Avenue,,Brooklyn,NY,11217,Final,200.00,FUNDR,Fundraising,fundraising event,,N,N
2003,5,J6,P,Johnson,Geoffrey,G,H,7,F,,,R0000338,9/10/2003 00:00:00,9/10/2003 00:00:00,206 W 121ST. H.D.F.C.,ORG,Y,206,W 121ST.,,NEW YORK,NY,10027,Final,550.00,RENTO,Office Rent,OFFICE SPACE,,N,N
2003,5,J6,P,Johnson,Geoffrey,G,H,7,F,,,R0000340,7/8/2003 00:00:00,7/8/2003 00:00:00,206 W 121ST. H.D.F.C.,ORG,Y,206,W 121ST.,,NEW YORK,NY,10027,Final,550.00,RENTO,Office Rent,OFFICE RENT,,N,N
2003,5,J6,P,Johnson,Geoffrey,G,H,7,F,,,R0000342,8/8/2003 00:00:00,8/8/2003 00:00:00,206 W 121ST. H.D.F.C.,ORG,Y,206,W 121ST.,,NEW YORK,NY,10027,Final,550.00,RENTO,Office Rent,OFFICE RENT,,N,N
2003,5,J6,P,Johnson,Geoffrey,G,H,5,F,,,R0000228,6/5/2003 00:00:00,6/5/2003 00:00:00,206 W 121ST. H.D.F.C.,ORG,Y,206,W 121ST.,,NEW YORK,NY,10027,Final,500.00,RENTO,Office Rent,RENT,,N,N
2003,5,CB,P,Montague,Virginia,M,H,5,F,,,R0000530,6/19/2003 00:00:00,6/19/2003 00:00:00,2304-2306 LLC,ORG,Y,,,,,,,Final,1500.00,OTHER,Other: explntion,OFFICE RENT,,N,N
2003,5,732,P,Sasson,Isaac,M,H,7,F,,,R0000838,9/2/2003 00:00:00,9/2/2003 00:00:00,3 GEN,ORG,Y,,,,,,,Final,15000.00,LITER,Campgn Lit.,PRINTING,,N,N
2003,5,732,P,Sasson,Isaac,M,H,7,F,,,R0000840,9/2/2003 00:00:00,9/2/2003 00:00:00,3 GEN,ORG,Y,,,,,,,Final,4000.00,CMAIL,Campgn Mlngs,DIRECT MAILING,,N,N
2003,5,732,P,Sasson,Isaac,M,H,7,F,,,R0000851,9/7/2003 00:00:00,9/7/2003 00:00:00,3 GEN,ORG,Y,,,,,,,Final,5000.00,CMAIL,Campgn Mlngs,PRINTING,,N,N
2003,5,732,P,Sasson,Isaac,M,H,7,F,,,R0000854,9/7/2003 00:00:00,9/7/2003 00:00:00,3 GEN,ORG,Y,,,,,,,Final,2000.00,CMAIL,Campgn Mlngs,MAILING,,N,N
2003,5,732,P,Sasson,Isaac,M,H,7,F,,,R0000844,9/4/2003 00:00:00,9/4/2003 00:00:00,3 GEN,ORG,Y,,,,,,,Final,3000.00,CMAIL,Campgn Mlngs,MAILING,,N,N
2003,5,732,P,Sasson,Isaac,M,H,6,F,,,R0000657,8/3/2003 00:00:00,8/3/2003 00:00:00,3 GEN,ORG,Y,,,,,,,Final,5000.00,CMAIL,Campgn Mlngs,DIRECT MAILING,,N,N
2003,5,732,P,Sasson,Isaac,M,H,6,F,,,R0000620,5/29/2003 00:00:00,5/29/2003 00:00:00,3 GEN,ORG,Y,,,,,,,Final,50.00,CMAIL,Campgn Mlngs,PRINTING,,N,N
2003,5,732,P,Sasson,Isaac,M,H,6,F,,,R0000623,5/29/2003 00:00:00,5/29/2003 00:00:00,3 GEN,ORG,Y,,,,,,,Final,450.00,CMAIL,Campgn Mlngs,PRINTING,,N,N
2003,5,732,P,Sasson,Isaac,M,H,7,F,,,R0000671,8/27/2003 00:00:00,8/27/2003 00:00:00,3 GEN,ORG,Y,,,,,,,Final,15000.00,PRINT,Print Ads,PRINTING,,N,N
2003,5,412,P,Wasserman,Abraham,E,I,11,F,,,R0000992,11/20/2003 00:00:00,12/26/2003 00:00:00,3 GEN CORP,ORG,Y,643,MONTGOMERY STREET,,BROOKLYN,NY,11213,Final,2150.00,LITER,Campgn Lit.,CAMPAIGN LITERATURE,,N,N
2003,5,412,P,Wasserman,Abraham,E,I,8,F,,,R0000602,9/28/2003 00:00:00,9/28/2003 00:00:00,3 GEN CORP,ORG,Y,643,MONTGOMERY STREET,,BROOKLYN,NY,11213,Final,351.00,OFFCE,Office Expenses,OFFICE EQUIPMENT,,N,N
2003,5,440,P,Mattera,Gloria,,I,7,F,,,R0000486,9/4/2003 00:00:00,9/4/2003 00:00:00,341 5TH AVENNUE DRAMA REALTY,ORG,Y,341,5TH AVENUE,,BROOKLYN,NY,11215,Final,3000.00,RENTO,Office Rent,SEC/DEPOSIT-OFFICE,,N,N
2003,5,440,P,Mattera,Gloria,,I,7,F,,,R0000487,9/9/2003 00:00:00,9/9/2003 00:00:00,341 5TH AVENNUE DRAMA REALTY,ORG,Y,341,5TH AVENUE,,BROOKLYN,NY,11215,Final,600.00,RENTO,Office Rent,BAL OF RENT-OFFICE,,N,N
2003,5,440,P,Mattera,Gloria,,I,8,F,,,R0000540,9/28/2003 00:00:00,9/28/2003 00:00:00,341 5TH AVENNUE DRAMA REALTY,ORG,Y,341,5TH AVENUE,,BROOKLYN,NY,11215,Final,1800.00,RENTO,Office Rent,RENT OCT - NOV. 9,,N,N
2003,5,FI,P,Liu,John,C,J,9,F,,,R0001488,10/17/2003 00:00:00,10/17/2003 00:00:00,38 A.D. COMMUNITY DEMOCRATIC C,ORG,Y,88-37,DORAN AVENUE,,QUEENS,NY,11385,Final,130.00,OTHER,Other: explntion,EVENT,,N,N
2003,5,264,P,Katz,Melinda,R,L,9,F,,,R0002081,10/7/2003 00:00:00,10/7/2003 00:00:00,38TH AD COMMUNITY DEM. CLUB,ORG,Y,88-37,DORAN AVENUE,,QUEENS,NY,11385,Final,130.00,OTHER,Other: explntion,EVENT,,N,N
2003,5,744,P,Evans,Stephen,M,H,8,F,,,R0000278,9/23/2003 00:00:00,9/23/2003 00:00:00,3G INTERNATIONAL GRAPHICS,ORG,Y,20,VANDAM STREET,,NEW YORK,NY,10013,Final,2251.00,FUNDR,Fundraising,LETTERHEAD/FLYERS,,N,N
2003,5,744,P,Evans,Stephen,M,H,10,F,,,R0000558,10/27/2003 00:00:00,10/27/2003 00:00:00,3G INTERNATIONAL GRAPHICS,ORG,Y,20,VANDAM STREET,,NEW YORK,NY,10013,Final,1412.00,CMAIL,Campgn Mlngs,POSTCARDS,,N,N
2003,5,729,P,Yablon,Joshua,,H,8,F,,,R0000390,9/22/2003 00:00:00,9/22/2003 00:00:00,420 BAR & LOUNGE,ORG,Y,420,AMSTERDAM AVE,,NEW YORK,NY,10024,Final,300.00,FUNDR,Fundraising,FUNDRAISER,,N,N
2003,5,HS,P,Sutliff,James,C,H,10,F,,,R0000424,10/28/2003 00:00:00,10/30/2003 00:00:00,4OVER4.COM,ORG,Y,24-64,45TH STREET,,QUEENS,NY,11103,Part,121.00,LITER,Campgn Lit.,CAMPAIGN MAILING,,N,N
2003,5,HS,P,Sutliff,James,C,H,10,F,,,R0000425,10/28/2003 00:00:00,10/30/2003 00:00:00,4OVER4.COM,ORG,Y,24-64,45TH STREET,,QUEENS,NY,11103,Final,1012.00,LITER,Campgn Lit.,CAMPAIGN MAILING,,N,N
2003,5,743,P,Mark-Viverito,Melissa,,H,7,F,,,R0000392,8/26/2003 00:00:00,8/26/2003 00:00:00,4OVER4.COM,ORG,Y,24-64,45 STREET,,QUEENS,NY,11103,Final,769.00,LITER,Campgn Lit.,PALM CARDS,,N,N
2003,5,HS,P,Sutliff,James,C,H,9,F,,,R0000331,10/10/2003 00:00:00,10/11/2003 00:00:00,4OVER4.COM,ORG,Y,24-64,45TH STREET,,QUEENS,NY,11103,Final,899.00,LITER,Campgn Lit.,POSTERS,,N,N
2003,5,264,P,Katz,Melinda,R,L,7,F,,,R0002037,9/10/2003 00:00:00,9/10/2003 00:00:00,504 DEMOCRATIC CLUB,ORG,Y,332,EAST 29TH STREET,5A,NEW YORK,NY,10016,Final,250.00,OTHER,Other: explntion,EVENT,,N,N
2003,5,204,P,Quinn,Christine,C,J,9,F,,,R0001370,10/3/2003 00:00:00,10/3/2003 00:00:00,504 DEMOCRATIC CLUB,ORG,Y,265,WEST 25TH STREET,2A,NEW YORK,NY,10001,Final,125.00,OTHER,Other: explntion,DINNER TICKET,,N,N
2003,5,BW,P,Moskowitz,Eva,S,H,9,F,,,R0002408,10/1/2003 00:00:00,10/1/2003 00:00:00,504 DEMOCRATIC CLUB,CORP,Y,332,EAST 29TH STREET,5A,NEW YORK,NY,10016,Final,500.00,OTHER,Other: explntion,job ad & fundraiser,,N,N
2003,5,204,P,Quinn,Christine,C,J,10,F,,,R0001617,10/28/2003 00:00:00,11/3/2003 00:00:00,504 DEMOCRATIC CLUB,ORG,Y,265,WEST 25TH STREET,2A,NEW YORK,NY,10001,Final,75.00,OTHER,Other: explntion,EVENT TICKET,,N,N
2003,5,D2,P,Perkins,Bill,,J,8,F,,,R0001316,9/26/2003 00:00:00,9/29/2003 00:00:00,504 DEMOCRATIC CLUB,ORG,Y,63-74,AUSTIN STREET,2E,QUEENS,NY,11374,Final,250.00,PRINT,Print Ads,JOURNAL AD,,N,N
2003,5,361,P,Rivera,Joel,,J,9,F,,,R0000854,10/6/2003 00:00:00,10/14/2003 00:00:00,504 DEMOCRATIC CLUB,ORG,Y,63-74,AUSTIN STREET,2 E,QUEENS,NY,11374,Final,125.00,PRINT,Print Ads,JOURNAL AD,,N,N
2003,5,418,P,Gioia,Eric,,H,4,F,,,R0002929,5/13/2003 00:00:00,5/13/2003 00:00:00,5128 Florist Inc.,CORP,Y,51-28,Roosevelt Ave.,,Queens,NY,11377,Final,850.00,OTHER,Other: explntion,Flowers,,N,N
2003,5,724,P,Santiago,Nellie,R,H,11,F,,,R0000561,12/26/2003 00:00:00,12/26/2003 00:00:00,54TH REGULAR DEMOCRATIC CLUB,ORG,Y,2817,FULTON STREET,,BROOKLYN,NY,11207,Final,3256.00,POLLS,Polling Costs,ELECTION DAY EXPENSE,,N,N
2003,5,724,P,Santiago,Nellie,R,H,6,F,,,R0000516,8/25/2003 00:00:00,8/25/2003 00:00:00,54TH REGULAR DEMOCRATIC CLUB,ORG,Y,2817,FULTON STREET,,BROOKLYN,NY,11207,Final,500.00,RENTO,Office Rent,OFFICE RENT,,N,N
2003,5,724,P,Santiago,Nellie,R,H,11,F,,,R0000555,9/22/2003 00:00:00,9/22/2003 00:00:00,54TH REGULAR DEMOCRATIC CLUB,ORG,Y,2817,FULTON STREET,,BROOKLYN,NY,11207,Final,125.00,RENTO,Office Rent,RENTAL OF OFFICE,,N,N
2003,5,724,P,Santiago,Nellie,R,H,4,F,,,R0000445,6/1/2003 00:00:00,6/13/2003 00:00:00,54TH REGULAR DEMOCRATIC CLUB,ORG,Y,2817,FULTON STREET,,BROOKLYN,NY,11207,Final,250.00,RENTO,Office Rent,OFFICE RENT,,N,N
2003,5,223,P,Martinez,Miguel,,I,2,F,,,R0000800,12/1/2002 00:00:00,12/2/2002 00:00:00,612 REALTY,CORP,Y,3810,14TH STREET,,BROOKLYN,NY,11218,Final,1750.00,OFFCE,Office Expenses,Office Rent,,N,N
2003,5,223,P,Martinez,Miguel,,I,4,F,,,R0001343,7/3/2003 00:00:00,7/3/2003 00:00:00,612 REALTY,CORP,Y,3810,14TH STREET,,BROOKLYN,NY,11218,Final,1750.00,RENTO,Office Rent,RENT,,N,N
2003,5,223,P,Martinez,Miguel,,I,5,F,,,R0001545,2/1/2003 00:00:00,2/3/2003 00:00:00,612 REALTY,CORP,Y,3810,14TH STREET,,BROOKLYN,NY,11218,Final,1750.00,RENTO,Office Rent,FEB RENT,,N,N
2003,5,207,P,Nelson,Michael,C,K,10,F,,,R0000802,10/21/2003 00:00:00,10/21/2003 00:00:00,61ST PRECINCT COMMUNITY COUNCI,ORG,Y,,CONEY IS AVE,,BROOKLYN,NY,11229,Final,50.00,CONSV,Constituent Svcs,SPONSOR MEETING,,N,N
2003,5,207,P,Nelson,Michael,C,K,10,F,,,R0000803,10/21/2003 00:00:00,10/21/2003 00:00:00,61ST PRECINCT COMMUNITY COUNCI,ORG,Y,,CONEY IS AVE,,BROOKLYN,NY,11229,Final,100.00,CONSV,Constituent Svcs,HOLIDAY PARTY,,N,N
2003,5,527,P,Fidler,Lewis,A,I,4,F,,,R0001065,5/14/2003 00:00:00,6/2/2003 00:00:00,69TH PRECINCT COMMUNITY COUNCI,ORG,Y,9720,FOSTER AVE,,BROOKLYN,NY,11236,Final,150.00,OTHER,Other: explntion,NATIONAL NIGHT OUT,,N,N
2003,5,490,P,Taitt,Samuel,A,I,3,F,,,R0000614,12/13/2002 00:00:00,12/13/2002 00:00:00,7-Eleven,OTHR,Y,2247,Utica Avenue,,Brooklyn,NY,11234,Final,11.00,FUNDR,Fundraising,Purchase-Fruit Juice,,N,N
2003,5,490,P,Taitt,Samuel,A,I,11,F,,,R0002024,9/2/2003 00:00:00,9/2/2003 00:00:00,7-Eleven,OTHR,Y,2247,Utica Avenue,,Brooklyn,NY,11234,Final,55.00,OTHER,Other: explntion,Sandwiches/juices,,N,N
2003,5,326,P,de Blasio,Bill,,J,2,F,,,R0001325,11/12/2002 00:00:00,11/12/2002 00:00:00,76th Precinct Com Council,OTHR,Y,191,Union street,,Brooklyn,NY,11231,Final,200.00,OTHER,Other: explntion,Awards dinner,,N,N
2003,5,717,P,Gentile,Vincent,J,J,10,F,,,R0001179,10/22/2003 00:00:00,10/22/2003 00:00:00,"889 DONUTS, INC.",ORG,Y,3860,5TH AVENUE,,BROOKLYN,NY,11232,Final,75.00,OTHER,Other: explntion,POST OFFICE DONUTS,,N,N
2003,5,ER,P,Jennings,Allan,W,I,4,F,,,R0001129,6/4/2003 00:00:00,6/4/2003 00:00:00,91-10 146 LLC,ORG,Y,144-31,91AVE,,QUEENS,NY,11435,Final,700.00,RENTO,Office Rent,RENT FOR JULY,,N,N
2003,5,722,P,Boucher,Omar,,H,6,F,,,R0000566,8/20/2003 00:00:00,8/20/2003 00:00:00,A PORTRAIT STUDIO,ORG,Y,5300,KINGS PLAZA,,BROOKLYN,NY,,Final,8.00,PROFL,Prof. Srvcs.,PHOTOGRAPHS,,N,N
2003,5,722,P,Boucher,Omar,,H,4,F,,,R0000310,5/13/2003 00:00:00,5/13/2003 00:00:00,A PORTRAIT STUDIO,ORG,Y,5300,KINGS PLAZA,,BROOKLYN,NY,,Final,22.00,PROFL,Prof. Srvcs.,PHOTOS FOR LITERATUR,,N,N
2003,5,272,P,Monserrate,Hiram,,J,4,F,,,R0000471,3/25/2003 00:00:00,3/25/2003 00:00:00,A REALI GOURMET,ORG,Y,46-08,HOLLIS COURT BOULEVARD,,QUEENS,NY,11358,Final,212.00,FUNDR,Fundraising,FOOD FOR FUNDRAISER,,N,N
2003,5,264,P,Katz,Melinda,R,L,10,F,,,R0002136,10/9/2003 00:00:00,10/29/2003 00:00:00,A T&T WIRELESS,ORG,Y,,PO BOX 8220,,AURORA,IL,60572,Final,605.00,OFFCE,Office Expenses,TELEPHONE,,N,N
2003,5,264,P,Katz,Melinda,R,L,2,F,,,R0001108,7/9/2002 00:00:00,8/2/2002 00:00:00,A T&T WIRELESS,ORG,Y,,PO BOX 8220,,AURORA,IL,60572,Final,252.00,OFFCE,Office Expenses,TELEPHONE,,N,N
2003,5,264,P,Katz,Melinda,R,L,2,F,,,R0001226,11/9/2002 00:00:00,11/19/2002 00:00:00,A T&T WIRELESS,ORG,Y,,PO BOX 8220,,AURORA,IL,60572,Final,845.00,OFFCE,Office Expenses,TELEPHONE,,N,N
2003,5,264,P,Katz,Melinda,R,L,2,F,,,R0001083,6/9/2002 00:00:00,7/17/2002 00:00:00,A T&T WIRELESS,ORG,Y,,PO BOX 8220,,AURORA,IL,60572,Part,445.00,OFFCE,Office Expenses,TELEPHONE,,N,N
2003,5,264,P,Katz,Melinda,R,L,2,F,,,R0001142,8/9/2002 00:00:00,8/26/2002 00:00:00,A T&T WIRELESS,ORG,Y,,PO BOX 8220,,AURORA,IL,60572,Final,288.00,OFFCE,Office Expenses,TELEPHONE,,N,N
2003,5,264,P,Katz,Melinda,R,L,2,F,,,R0001165,9/9/2002 00:00:00,9/25/2002 00:00:00,A T&T WIRELESS,ORG,Y,,PO BOX 8220,,AURORA,IL,60572,Part,294.00,OFFCE,Office Expenses,TELEPHONE,,N,N
2003,5,264,P,Katz,Melinda,R,L,2,F,,,R0001301,12/9/2002 00:00:00,1/11/2003 00:00:00,A T&T WIRELESS,ORG,Y,,PO BOX 8220,,AURORA,IL,60572,Final,393.00,OFFCE,Office Expenses,TELEPHONE,,N,N
2003,5,264,P,Katz,Melinda,R,L,1,F,,,R0000799,3/9/2002 00:00:00,3/21/2002 00:00:00,A T&T WIRELESS,ORG,Y,,PO BOX 8220,,AURORA,IL,60572,Final,863.00,OFFCE,Office Expenses,TELEPHONE,,N,N
2003,5,264,P,Katz,Melinda,R,L,1,F,,,R0000819,4/9/2002 00:00:00,5/7/2002 00:00:00,A T&T WIRELESS,ORG,Y,,PO BOX 8220,,AURORA,IL,60572,Final,418.00,OFFCE,Office Expenses,TELEPHONE,,N,N
2003,5,264,P,Katz,Melinda,R,L,1,F,,,R0000874,5/9/2002 00:00:00,6/3/2002 00:00:00,A T&T WIRELESS,ORG,Y,,PO BOX 8220,,AURORA,IL,60572,Final,421.00,OFFCE,Office Expenses,TELEPHONE,,N,N
2003,5,264,P,Katz,Melinda,R,L,4,F,,,R0001856,5/9/2003 00:00:00,6/24/2003 00:00:00,A T&T WIRELESS,ORG,Y,,PO BOX 8220,,AURORA,IL,60572,Final,792.00,OFFCE,Office Expenses,TELEPHONE,,N,N
2003,5,264,P,Katz,Melinda,R,L,4,F,,,R0001858,6/9/2003 00:00:00,6/24/2003 00:00:00,A T&T WIRELESS,ORG,Y,,PO BOX 8220,,AURORA,IL,60572,Final,955.00,OFFCE,Office Expenses,TELEPHONE,,N,N
2003,5,264,P,Katz,Melinda,R,L,4,F,,,R0001720,2/9/2003 00:00:00,2/9/2003 00:00:00,A T&T WIRELESS,ORG,Y,,PO BOX 8220,,AURORA,IL,60572,Final,783.00,OFFCE,Office Expenses,TELEPHONE,,N,N
2003,5,264,P,Katz,Melinda,R,L,4,F,,,R0001675,1/9/2003 00:00:00,2/3/2003 00:00:00,A T&T WIRELESS,ORG,Y,,PO BOX 8220,,AURORA,IL,60572,Final,273.00,OFFCE,Office Expenses,TELEPHONE,,N,N
2003,5,264,P,Katz,Melinda,R,L,5,F,,,R0001938,6/19/2003 00:00:00,7/16/2003 00:00:00,A T&T WIRELESS,ORG,Y,,PO BOX 8220,,AURORA,IL,60572,Final,174.00,OFFCE,Office Expenses,TELEPHONE,,N,N
2003,5,264,P,Katz,Melinda,R,L,5,F,,,R0001940,6/9/2003 00:00:00,7/16/2003 00:00:00,A T&T WIRELESS,ORG,Y,,PO BOX 8220,,AURORA,IL,60572,Final,264.00,OFFCE,Office Expenses,TELEPHONE,,N,N
2003,5,264,P,Katz,Melinda,R,L,9,F,,,R0002078,10/3/2003 00:00:00,10/3/2003 00:00:00,A T&T WIRELESS,ORG,Y,,PO BOX 8220,,AURORA,IL,60572,Final,856.00,OFFCE,Office Expenses,TELEPHONE,,N,N
2003,5,DD,P,Barron,Charles,,J,6,F,,,R0000839,8/18/2003 00:00:00,8/18/2003 00:00:00,A&D HARDWARD,ORG,Y,595,NEW LOTS AVENUE,,BROOKLYN,NY,11207,Final,182.00,OTHER,Other: explntion,SUPPLIES,,N,N
2003,5,334,P,Gallagher,Dennis,P,I,10,F,,,R0002238,11/3/2003 00:00:00,11/3/2003 00:00:00,A&J FRUIT MARKET,ORG,Y,74-17,METROPOLITAN AVENUE,,QUEENS,NY,11379,Final,288.00,CONSV,Constituent Svcs,APPLES,,N,N
2003,5,334,P,Gallagher,Dennis,P,I,2,F,,,R0001341,10/12/2002 00:00:00,10/31/2002 00:00:00,A&J FRUIT MARKET,ORG,Y,74-17,METROPOLITAN AVENUE,,QUEENS,NY,11379,Final,72.00,CONSV,Constituent Svcs,APPLES,,N,N
2003,5,207,P,Nelson,Michael,C,K,2,F,,,R0000497,10/29/2002 00:00:00,10/29/2002 00:00:00,A&S BAKERY,ORG,Y,200,AVENUE S,,BROOKLYN,NY,11223,Final,42.00,OTHER,Other: explntion,DUES,,N,N
2003,5,717,P,Gentile,Vincent,J,J,10,F,,,R0001368,11/4/2003 00:00:00,11/4/2003 00:00:00,A&S PORK STORE,ORG,Y,8605,FIFTH AVENUE,,BROOKLYN,NY,11209,Final,125.00,OTHER,Other: explntion,ELEC. DAY FOOD,,N,N
2003,5,LW,P,Recchia,Domenic,M,I,10,F,,,R0001059,11/3/2003 00:00:00,11/3/2003 00:00:00,A&S PORK STORES,ORG,Y,361,AVENUE X,,BROOKLYN,NY,11223,Final,450.00,OTHER,Other: explntion,ELECTION DAY FOOD,,N,N
2003,5,214,P,Oddo,James,S,L,9,F,,,R0001203,10/16/2003 00:00:00,10/16/2003 00:00:00,A. CITY DISTRIBUTORS,ORG,Y,147,WINDHAM LOOP,,STATEN ISLAND,NY,10314,Final,200.00,LITER,Campgn Lit.,LITERATURE DISTRIBUT,,N,N
2003,5,214,P,Oddo,James,S,L,9,F,,,R0001224,9/30/2003 00:00:00,9/30/2003 00:00:00,A. CITY DISTRIBUTORS,ORG,Y,147,WINDHAM LOOP,,STATEN ISLAND,NY,10314,Final,200.00,LITER,Campgn Lit.,LITERATURE DISTRIBUT,,N,N
2003,5,214,P,Oddo,James,S,L,9,F,,,R0001184,10/3/2003 00:00:00,10/3/2003 00:00:00,A. CITY DISTRIBUTORS,ORG,Y,147,WINDHAM LOOP,,STATEN ISLAND,NY,10314,Final,200.00,LITER,Campgn Lit.,LITERATURE DISTRIBUT,,N,N
2003,5,214,P,Oddo,James,S,L,10,F,,,R0001321,11/2/2003 00:00:00,11/2/2003 00:00:00,A. CITY DISTRIBUTORS,ORG,Y,147,WINDHAM LOOP,,STATEN ISLAND,NY,10314,Final,200.00,CMAIL,Campgn Mlngs,DISTRIBUTION OF LIT.,,N,N
2003,5,214,P,Oddo,James,S,L,10,F,,,R0001312,10/28/2003 00:00:00,10/28/2003 00:00:00,A. CITY DISTRIBUTORS,ORG,Y,147,WINDHAM LOOP,,STATEN ISLAND,NY,10314,Final,800.00,CMAIL,Campgn Mlngs,DISTRIBUTION OF LIT.,,N,N
2003,5,490,P,Taitt,Samuel,A,I,11,N,,,R0000588,,12/13/2002 00:00:00,A. J. Plants,OTHR,Y,4718,Avenue D,,Brooklyn,NY,11203,,60.00,FUNDR,Fundraising,Flowers,,N,N
2003,5,361,P,Rivera,Joel,,J,10,F,,,R0001154,10/27/2003 00:00:00,10/28/2003 00:00:00,A. M. Productions,CORP,Y,310,West 56th St,10 H,New York,NY,10019,Final,325.00,OTHER,Other: explntion,Equipment Rental,,N,N
2003,5,724,P,Santiago,Nellie,R,H,7,F,,,R0000540,9/5/2003 00:00:00,9/5/2003 00:00:00,A.I.C.,ORG,Y,288,ALEXANDER AVENUE,,BRONX,NY,10454,Final,15000.00,CONSL,Campgn Consuls.,CONSULTANT,,N,N
2003,5,724,P,Santiago,Nellie,R,H,7,F,,,R0000542,9/8/2003 00:00:00,9/8/2003 00:00:00,A.I.C.,ORG,Y,288,ALEXANDER AVENUE,,BRONX,NY,10454,Final,10000.00,CONSL,Campgn Consuls.,CONSULTANT,,N,N
2003,5,724,P,Santiago,Nellie,R,H,7,F,,,R0000547,9/10/2003 00:00:00,9/10/2003 00:00:00,A.I.C.,ORG,Y,288,ALEXANDER AVENUE,,BRONX,NY,10454,Final,25000.00,CONSL,Campgn Consuls.,CONSULTANT,,N,N
2003,5,724,P,Santiago,Nellie,R,H,6,F,,,R0000509,8/8/2003 00:00:00,8/8/2003 00:00:00,A.I.C.,ORG,Y,288,ALEXANDER AVENUE,,BRONX,NY,10454,Final,10000.00,CONSL,Campgn Consuls.,CONSULTANT,,N,N
2003,5,724,P,Santiago,Nellie,R,H,5,F,,,R0000481,7/28/2003 00:00:00,7/28/2003 00:00:00,A.I.C.,ORG,Y,288,ALEXANDER AVENUE,,BRONX,NY,10454,Final,15000.00,CONSL,Campgn Consuls.,CONSULTANT,,N,N
2003,5,737,P,Mossa,Michael,,H,10,F,,,R0001360,10/30/2003 00:00:00,11/22/2003 00:00:00,A.T.&T,CORP,Y,,POB 9001309,,LOUISVILLE,KY,40290,Final,145.00,OFFCE,Office Expenses,CELL PHONE,,N,N
2003,5,737,P,Mossa,Michael,,H,9,F,,,R0000906,10/20/2003 00:00:00,10/20/2003 00:00:00,A.T.&T,CORP,Y,,POB 9001309,,LOUISVILLE,KY,40290,Final,313.00,OFFCE,Office Expenses,PHONE BILL,,N,N
2003,5,737,P,Mossa,Michael,,H,11,F,,,R0001398,11/9/2003 00:00:00,12/8/2003 00:00:00,A.T.&T,CORP,Y,,POB 9001309,,LOUISVILLE,KY,40290,Final,76.00,OFFCE,Office Expenses,EXTRA CELL MINUTES,,N,N