ELECTION,OFFICECD,RECIPID,CANCLASS,RECIPNAME,COMMITTEE,FILING,SCHEDULE,PAGENO,SEQUENCENO,REFNO,DATE,REFUNDDATE,NAME,C_CODE,STRNO,STRNAME,APARTMENT,BOROUGHCD,CITY,STATE,ZIP,OCCUPATION,EMPNAME,EMPSTRNO,EMPSTRNAME,EMPCITY,EMPSTATE,AMNT,MATCHAMNT,PREVAMNT,PAY_METHOD,INTERMNO,INTERMNAME,INTSTRNO,INTSTRNM,INTAPTNO,INTCITY,INTST,INTZIP,INTEMPNAME,INTEMPSTNO,INTEMPSTNM,INTEMPCITY,INTEMPST,INTOCCUPA,PURPOSECD,EXEMPTCD,ADJTYPECD,RR_IND,SEG_IND,INT_C_CODE
2025,2,1227,P,"Williams, Jumaane D",R,4,ABC,,,R0040574,1/12/2024,,32 BJ United ADF,EMPO,,,,M,New York,NY,10011,,,,,,,2100,0,0,2,,,,,,,,,,,,,,,,,,N,N,
2025,3,1164,P,"Lander, Brad",N,2,ABC,,,R0064837,1/13/2023,,32BJ United ADF,PCOMP,,,,M,New York,NY,10011,,,,,,,2100,0,0,2,,,,,,,,,,,,,,,,,,N,N,
2025,4,1550,P,"Reynoso, Antonio",M,4,ABC,,,R0017598,1/11/2024,,32BJ United ADF,PCOMP,,,,M,New York,NY,10011,,,,,,,1600,0,0,2,,,,,,,,,,,,,,,,,,N,N,
2025,4,1707,P,"Gibson, Vanessa L",N,3,ABC,,,R0011864,7/13/2023,,32BJ United ADF,OTHR,,,,M,New York,NY,10011,,,,,,,1600,0,0,2,,,,,,,,,,,,,,,,,,N,N,
2025,4,311,P,"Levine, Mark",P,3,ABC,,,R0021101,5/16/2023,,32BJ UNITED ADF,PCOMP,,,,M,New York,NY,10011,,,,,,,1600,0,0,2,,,,,,,,,,,,,,,,,,N,N,
2025,1,1545,P,"Adams, Eric L",N,1,ABC,,,R0079857,3/7/2022,,"A Nelson, George",IND,,,,Z,Chicago,IL,60660,Not Employed,Not Employed,5855,N. Sheridan Road,Chicago,IL,2000,0,0,4,,,,,,,,,,,,,,,,,,N,N,
2025,1,1545,P,"Adams, Eric L",N,1,ABC,,,R0079662,2/21/2022,,"A. Murray, Bryan",IND,,,,Z,Memphis,TN,38119,Government Relations,Acreage Holdings,6896,Kingham Cove,Memphiss,TN,500,0,0,4,,,,,,,,,,,,,,,,,,N,N,
2025,1,1545,P,"Adams, Eric L",N,4,ABC,,,R0087641,8/28/2023,,"Aaliyan, Rocky",IND,,,,Z,West Hempstead,NY,11552,Star Furniture,Rocky Aaliyan,555,Adams Avenue,West Hempstead,NY,1000,0,0,4,,,,,,,,,,,,,,,,,,N,N,
2025,3,1164,P,"Lander, Brad",N,2,ABC,,,R0064082,11/15/2022,,"Aalyson, Molly",IND,,,,Z,Belmont,MA,2478,Not Employed,Not Employed,,,,,500,0,0,4,,,,,,,,,,,,,,,,,,N,N,
2025,4,311,P,"Levine, Mark",P,3,ABC,,,R0020692,2/7/2023,,"Aalyson, Molly",IND,,,,Z,Belmont,MA,2478,unemployed,,,,,,25,0,0,4,,,,,,,,,,,,,,,,,,N,N,
2025,4,311,P,"Levine, Mark",P,3,ABC,,,R0021090,5/17/2023,,"Aalyson, Molly",IND,,,,Z,Belmont,MA,2478,unemployed,,,,,,50,0,25,4,,,,,,,,,,,,,,,,,,N,N,
2025,3,1164,P,"Lander, Brad",N,3,ABC,,,R0067911,7/10/2023,,"Aaron, Katherine",IND,,,,K,Brooklyn,NY,11215,Producer,Self,484,1st Street,Brooklyn,NY,250,250,0,4,,,,,,,,,,,,,,,,,,N,N,
2025,4,311,P,"Levine, Mark",P,2,ABC,,,R0020324,1/10/2023,,"Aaronson, Stuart",IND,,,,M,New York`,NY,10027,Student Advisor,Columbia University School of,1255,Amsterdam Ave.,New York,NY,25,25,0,4,,,,,,,,,,,,,,,,,,N,N,
2025,4,311,P,"Levine, Mark",P,4,ABC,,,R0022604,12/20/2023,,"Aaronson, Stuart",IND,,,,M,New York`,NY,10027,Student Advisor,Columbia University School of,1255,Amsterdam Ave.,New York,NY,25,25,25,4,,,,,,,,,,,,,,,,,,N,N,
2025,1,1545,P,"Adams, Eric L",N,3,ABC,,,R0084139,5/31/2023,,"Abadi, Robert",IND,,,,K,Brooklyn,NY,11229,Manufacturing,Robert abadi,3981,Bedford avenue,Brooklyn,NY,1500,250,0,4,,,,,,,,,,,,,,,,,,N,N,
2025,1,1545,P,"Adams, Eric L",N,4,ABC,,,R0088045,9/27/2023,,"Abakporo, Theophine",IND,,,,Q,Cambria Heights,NY,11411,NYU,Physician,760,Broadway,Brooklyn,NY,250,250,0,4,,,,,,,,,,,,,,,,,,N,N,
2025,4,1707,P,"Gibson, Vanessa L",N,3,ABC,,,R0011317,4/23/2023,,"Abamed, Monsur",IND,,,,X,Bronx,NY,10472,,Not Employed,,,,,30,0,0,4,,,,,,,,,,,,,,,,,,N,N,
2025,1,1545,P,"Adams, Eric L",N,1,ABC,,,R0082039,4/21/2022,,"Abbamondi, John",IND,,,,K,Brooklyn,NY,11215,CEO,BSE Global,168,39th Street,Brooklyn,NY,400,250,0,2,,,,,,,,,,,,,,,,,,N,N,
2025,4,1550,P,"Reynoso, Antonio",M,3,ABC,,,R0015371,5/17/2023,,"Abbass, Fazal",IND,,,,Q,Inwood,NY,11096,Trainer,Self-Employed,72,Walnut Road,Inwood,NY,488,0,0,4,,,,,,,,,,,,,,,,,,N,N,
2025,2,2832,P,"Medina, Sarah",H,4,ABC,,,R0000017,10/24/2023,,"Abbott, Briahna",IND,,,,K,Brooklyn,NY,11208,Firefighter,HIFD,225,Sutter Avenue,Brooklyn,NY,80,0,0,4,,,,,,,,,,,,,,,,,,N,N,
2025,4,311,P,"Levine, Mark",P,4,ABC,,,R0021741,9/25/2023,,"Abboud, Salim",IND,,,,Z,Singac,NJ,7424,Banking,Interaudi Bank,19,East 54th Street,New York,NY,500,0,0,4,,,,,,,,,,,,,,,,,,N,N,
2025,3,1164,P,"Lander, Brad",N,4,ABC,,,R0070965,1/12/2024,,"Abdessalam, Zayne",IND,,,,K,BROOKLYN,NY,11218,Policy researcher,New York State,1,State Plaza,New York,NY,5,5,0,4,,,,,,,,,,,,,,,,,,N,N,
2025,1,1545,P,"Adams, Eric L",N,1,ABC,,,R0079796,3/1/2022,,"Abdullayev, Zaur",IND,,,,K,Brooklyn,NY,11235,Owner,GN Express,2211,Avenue Z,Brooklyn,NY,2000,250,0,4,,,,,,,,,,,,,,,,,,N,N,
2025,5,2835,P,"Batchu, Sarah L",H,4,ABC,,,R0000445,1/3/2024,,"ABDUR-RASHID, SABURA",IND,,,,M,New York,NY,10009,Retired,,373,East 8th Street,New York,NY,10,10,0,4,,,,,,,,,,,,,,,,,,N,N,
2025,1,1545,P,"Adams, Eric L",N,1,ABC,,,R0080246,4/20/2022,,"Abed, Nasri",IND,,,,S,Staten Island,NY,10304,Supermarket,8210foodcorp,105,Buttonwood Rd,Staten Island,NY,2000,250,0,4,,,,,,,,,,,,,,,,,,N,N,
2025,1,1545,P,"Adams, Eric L",N,1,ABC,,,R0080495,4/29/2022,,"Abed, Sam",IND,,,,S,Staten Island,NY,10314,Store Manager,KeyFood,319,Kings Highway,Brooklyn,NY,2000,250,0,4,,,,,,,,,,,,,,,,,,N,N,
2025,1,1545,P,"Adams, Eric L",N,1,ABC,,,R0080493,4/29/2022,,"Abed, Yousef",IND,,,,S,Staten island,NY,10301,Engineer,Direct current,282,Laconia Ave,Staten Island,NY,1000,250,0,4,,,,,,,,,,,,,,,,,,N,N,
2025,1,1545,P,"Adams, Eric L",N,1,ABC,,,R0080801,6/14/2022,,"Aberra, David",IND,,,,Z,Upper Marlboro,MD,20774,Vice President,Newmark,7700,Wisconsin Ave,Bethesda,MD,10,0,0,4,,,,,,,,,,,,,,,,,,N,N,
2025,3,1164,P,"Lander, Brad",N,4,ABC,,,R0068471,8/24/2023,,"Abraham, Thomas",IND,,,,M,New York,NY,10026,Professor,Kean University,101,W 117 St,New York,NY,10,10,0,4,,,,,,,,,,,,,,,,,,N,N,
2025,3,1164,P,"Lander, Brad",N,2,ABC,,,R0064188,12/1/2022,,"Abraham-Inz, Anita",IND,,,,K,Brooklyn,NY,11201,Not Employed,Not Employed,,,,,200,200,0,4,,,,,,,,,,,,,,,,,,N,N,
2025,1,1545,P,"Adams, Eric L",N,3,ABC,,,R0084679,6/12/2023,,"Abramchick, Amir",IND,,,,Q,Kew Gardens Hills,NY,11367,COO,Centers Health Care,4770,White Plains Rd,Kew Gardens Hills,NY,2000,250,0,2,,,,,,,,,,,,,,,,,,N,N,
2025,1,1545,P,"Adams, Eric L",N,3,ABC,,,R0084681,6/12/2023,,"Abramchick, Deborah",IND,,,,K,Brooklyn,NY,11236,Homemaker,,,,,,2000,250,0,2,,,,,,,,,,,,,,,,,,N,N,
2025,1,1545,P,"Adams, Eric L",N,3,ABC,,,R0084961,6/6/2023,,"Abramov, Iosif",IND,,,,Q,Jamaica,NY,11432,Construction,RJ Capital Construction,215-15,northern Blvd suite 301,Bayside,NY,2100,0,0,4,,,,,,,,,,,,,,,,,,N,N,
2025,1,1545,P,"Adams, Eric L",N,3,ABC,,,R0084967,6/6/2023,,"Abramov, Iosif",IND,,,,Q,Jamaica,NY,11432,Construction,RJ Capital Construction,215-15,northern Blvd suite 301,Bayside,NY,2100,250,0,4,,,,,,,,,,,,,,,,,,N,N,
2025,1,1545,P,"Adams, Eric L",N,4,M,,,R0089078,6/6/2023,1/9/2024,"Abramov, Iosif",IND,,,,Q,Jamaica,NY,11432,,,,,,,-2100,0,0,0,,,,,,,,,,,,,,,,,2,N,N,
2025,4,1190,P,"Richards, Donovan",O,4,ABC,,,R0021626,12/13/2023,,"Abrams, Joshua",IND,,,,Q,Astoria,NY,11105,Attorney,Beazley,45,Rockefeller Plaza,New York,NY,50,50,0,4,,,,,,,,,,,,,,,,,,N,N,
2025,3,1164,P,"Lander, Brad",N,4,ABC,,,R0069095,11/17/2023,,"Abrams, Lauren",IND,,,,K,BROOKLYN,NY,11215,midwife,Mount Sinai Hospital,255,Fieldston Terrace,Bronx,NY,27,27,0,4,,,,,,,,,,,,,,,,,,N,N,
2025,4,311,P,"Levine, Mark",P,4,ABC,,,R0022874,1/12/2024,,"Abrams, Vicki",IND,,,,M,New York,NY,10028,Unemployed,,,,,,100,100,0,4,,,,,,,,,,,,,,,,,,N,N,
2025,3,1164,P,"Lander, Brad",N,3,ABC,,,R0067803,7/2/2023,,"Abramson, David",IND,,,,K,Brooklyn,NY,11215,Architect,CTS Group,17,Commerce St,Chatham,NJ,1000,250,0,4,,,,,,,,,,,,,,,,,,N,N,
2025,4,1550,P,"Reynoso, Antonio",M,3,ABC,,,R0015339,5/15/2023,,"Abramson, David",IND,,,,K,Brooklyn,NY,11215,Architect,CTS Group,17,Commerce Street,Chatham,NJ,175,175,0,4,,,,,,,,,,,,,,,,,,N,N,
2025,4,1550,P,"Reynoso, Antonio",M,4,ABC,,,R0017065,11/28/2023,,"Abramson, David",IND,,,,K,Brooklyn,NY,11215,Architect,CTS Group,17,Commerce Street,Chatham,NJ,50,0,175,4,,,,,,,,,,,,,,,,,,N,N,
2025,3,1164,P,"Lander, Brad",N,2,ABC,,,R0064528,1/10/2023,,"Abramson, Sandra",IND,,,,M,New York,NY,10025,Not Employed,Not Employed,,,,,18,18,0,4,,,,,,,,,,,,,,,,,,N,N,
2025,3,1164,P,"Lander, Brad",N,3,ABC,,,R0065779,4/12/2023,,"Abramson, Sandra",IND,,,,M,New York,NY,10025,Not Employed,Not Employed,,,,,250,232,18,4,,,,,,,,,,,,,,,,,,N,N,
2025,3,1164,P,"Lander, Brad",N,3,ABC,,,R0066915,5/27/2023,,"Abramson, Sandra",IND,,,,M,New York,NY,10025,Not Employed,Not Employed,,,,,36,0,268,4,,,,,,,,,,,,,,,,,,N,N,
2025,3,1164,P,"Lander, Brad",N,4,ABC,,,R0069743,12/28/2023,,"Abramson, Sandra",IND,,,,M,New York,NY,10025,Not Employed,Not Employed,,,,,50,0,304,4,,,,,,,,,,,,,,,,,,N,N,
2025,4,311,P,"Levine, Mark",P,3,ABC,,,R0020605,1/21/2023,,"Abramson, William D",IND,,,,M,New York,NY,10024,Dir of Real Estate Brokerage,Buchbinder & Warren,1,Union Square West,New York,NY,1600,175,0,2,,,,,,,,,,,,,,,,,,N,N,
2025,1,1545,P,"Adams, Eric L",N,1,ABC,,,R0080499,4/29/2022,,"Abuasi, Saed",IND,,,,S,Staten Island,NY,10314,Self,Self,407,Fanning St,Staten Island,NY,200,200,0,4,,,,,,,,,,,,,,,,,,N,N,
2025,1,1545,P,"Adams, Eric L",N,1,ABC,,,R0080485,4/28/2022,,"Abushi, Abed",IND,,,,Z,Maspeth,NY,11378,CEO,Abushi Inc.,44-03,56th Rd,Maspeth,NY,1000,0,0,4,,,,,,,,,,,,,,,,,,N,N,
2025,1,1545,P,"Adams, Eric L",N,4,ABC,,,R0088335,10/8/2023,,"Acar, Zafer",IND,,,,Q,Flushing,NY,11374,Atis Global LLC,Managing Director,98-50,67th Ave,Flushing,NY,2100,250,0,4,,,,,,,,,,,,,,,,,,N,N,
2025,3,1164,P,"Lander, Brad",N,3,ABC,,,R0065823,4/14/2023,,"Acciardi, Michael",IND,,,,Z,Fort Lauderdale,FL,33306,Property developer,Dragon inc,117,Lincoln Pl,Waldwick,NJ,250,0,0,4,,,,,,,,,,,,,,,,,,N,N,
2025,3,1164,P,"Lander, Brad",N,3,ABC,,,R0068203,7/11/2023,,ACEC New York City PAC,PCOMP,,,,,New York,NY,10018,,,,,,,1000,0,0,2,,,,,,,,,,,,,,,,,,N,N,
2025,4,1707,P,"Gibson, Vanessa L",N,3,ABC,,,R0011838,7/12/2023,,ACEC NEW YORK CITY PAC,PCOMP,,,,M,New York,NY,10018,,,,,,,1000,0,0,2,,,,,,,,,,,,,,,,,,N,N,
2025,3,1164,P,"Lander, Brad",N,3,ABC,,,R0065359,2/19/2023,,"Achtenberg, Linda",IND,,,,M,New York,NY,10025,Not Employed,Not Employed,,,,,50,50,0,4,,,,,,,,,,,,,,,,,,N,N,
2025,4,311,P,"Levine, Mark",P,4,ABC,,,R0022854,1/11/2024,,"Aciman, Andre",IND,,,,M,New York,NY,10025,Author/Professor,City University,365,5th Avenue,New York,NY,250,175,0,4,,,,,,,,,,,,,,,,,,N,N,
2025,3,1164,P,"Lander, Brad",N,3,ABC,,,R0067103,6/9/2023,,"ackelsberg, martha",IND,,,,M,New York,NY,10032,Not Employed,Not Employed,779,Riverside Dr,New York,NY,250,250,0,4,,,,,,,,,,,,,,,,,,N,N,
2025,1,1545,P,"Adams, Eric L",N,1,ABC,,,R0080657,6/15/2022,,"Ackerman, Ari",IND,,,,M,ny,NY,10011,Not Employed,Not Employed,,,,,500,250,0,4,,,,,,,,,,,,,,,,,,N,N,
2025,1,1545,P,"Adams, Eric L",N,3,ABC,,,R0083792,5/23/2023,,"Ackerman, Paul",IND,,,,Q,Kew Gardens,NY,11415,Orthopedic Surgeon,Self,3041,Ave U,Brooklyn,NY,2100,250,0,2,,,,,,,,,,,,,,,,,,N,N,
2025,5,2836,P,"Okporo, Edafe",H,4,ABC,,,R0000102,12/11/2023,,"Ackley, Joshua",IND,,,,K,Brooklyn,NY,11211,PR,Self-Employed,55,Hope Street,Brooklyn,NY,75,0,0,4,,,,,,,,,,,,,,,,,,N,N,
2025,3,1164,P,"Lander, Brad",N,3,ABC,,,R0067291,6/22/2023,,"Ackman, David",IND,,,,Z,Madison,CT,6443,Physician,Anthem,61,Hartford Ave,Madison,CT,100,0,0,4,,,,,,,,,,,,,,,,,,N,N,
2025,4,1550,P,"Reynoso, Antonio",M,3,ABC,,,R0016310,7/4/2023,,"Acosta, Carmen",IND,,,,K,Brooklyn,NY,11210,Retired,,,,,,25,25,0,4,,,,,,,,,,,,,,,,,,N,N,
2025,1,1545,P,"Adams, Eric L",N,2,ABC,,,R0083010,10/26/2022,,"Acosta, Dalsia",IND,,,,Z,Cliffside Park,NJ,7010,Medical Doctor,Academy Medical Care PC,571,Academy Street,New York,NY,2000,0,0,2,,,,,,,,,,,,,,,,,,N,N,
2025,5,2835,P,"Batchu, Sarah L",H,4,ABC,,,R0000559,1/6/2024,,"Acosta, Lucy",IND,,,,M,New York,NY,10009,Self Employed,Karibbean Restaurant,125,Avenue D,New York,NY,10,10,0,1,,,,,,,,,,,,,,,,,,N,N,
2025,1,1545,P,"Adams, Eric L",N,3,ABC,,,R0086484,7/7/2023,,"Acosta, Maritza",IND,,,,Z,Warwick,NY,10990,Police Officer,NYPD,1,Police Plaza,PECK SLIP,NY,1000,0,0,2,,,,,,,,,,,,,,,,,,N,N,
2025,3,1164,P,"Lander, Brad",N,4,ABC,,,R0068902,10/26/2023,,"Acosta, Rolando",IND,,,,Z,Toms River,NJ,8755,Contractor,Northeast Remsco Construction,1333,Campus Parkway,Wall,NJ,250,0,0,4,118,"Ortmann, Erik",,,,East Islip,NY,11730,Kaufman Dolowich Voluck LLP,135,Crossways Park Dr,Woodbury,NY,Attorney,,,,N,N,IND
2025,4,1550,P,"Reynoso, Antonio",M,3,ABC,,,R0015297,5/11/2023,,"Acosta-Grimes, Zila",IND,,,,X,Bronx,NY,10467-510,Unemployed,,,,,,175,175,0,4,,,,,,,,,,,,,,,,,,N,N,
2025,1,1545,P,"Adams, Eric L",N,3,ABC,,,R0085443,6/14/2023,,"Acquista, Angelo",IND,,,,M,New York,NY,10022,Managing Director Executive an,Northwell,2000,Marcus Avenue,New Hyde Park,NY,1250,250,0,4,,,,,,,,,,,,,,,,,,N,N,
2025,4,1550,P,"Reynoso, Antonio",M,3,ABC,,,R0015348,5/15/2023,,"Adames, Roberto",IND,,,,Q,Far Rockaway,NY,11691,Lab Tech,Regeneron,777,Old Saw Mill River Road,Tarrytown,NY,100,100,0,4,,,,,,,,,,,,,,,,,,N,N,
2025,3,1164,P,"Lander, Brad",N,4,ABC,,,R0068367,8/8/2023,,"Adams, Amelia",IND,,,,M,New York,NY,10004,Consultant,Adams Advisors LLC,1,Battery Park Plaza,New York,NY,100,100,0,4,,,,,,,,,,,,,,,,,,N,N,
2025,1,1545,P,"Adams, Eric L",N,3,ABC,,,R0084113,5/25/2023,,"Adams, Amelia",IND,,,,M,New York,NY,10004,Consultant,Self,69,Rutland Rd,Brooklyn,NY,400,0,0,4,,,,,,,,,,,,,,,,,,N,N,
2025,4,1550,P,"Reynoso, Antonio",M,3,ABC,,,R0015416,5/17/2023,,"Adams, Amelia",IND,,,,K,Brooklyn,NY,11225,Consultant,Adams Buckner Advisors,One,Battery Park Plaza,New York,NY,250,0,0,4,,,,,,,,,,,,,,,,,,N,N,
2025,4,1707,P,"Gibson, Vanessa L",N,2,ABC,,,R0010404,9/28/2022,,"Adams, Amelia",IND,,,,M,BOWLING GREEN,NY,10004,Consultant,Adams Advisors,1,Battery Park Plz,BOWLING GREEN,NY,250,0,0,4,,,,,,,,,,,,,,,,,,N,N,
2025,4,1707,P,"Gibson, Vanessa L",N,3,ABC,,,R0011193,4/4/2023,,"Adams, Amelia",IND,,,,M,BOWLING GREEN,NY,10004,Consultant,Adams Advisors,1,Battery Park Plz,BOWLING GREEN,NY,320,0,250,4,,,,,,,,,,,,,,,,,,N,N,
2025,4,1707,P,"Gibson, Vanessa L",N,4,M,,,R0011927,4/4/2023,7/27/2023,"Adams, Amelia",IND,,,,M,BOWLING GREEN,NY,10004,,,,,,,-250,0,0,0,,,,,,,,,,,,,,,,,2,N,N,
2025,4,311,P,"Levine, Mark",P,3,ABC,,,R0021075,5/15/2023,,"Adams, Amelia",IND,,,,M,BOWLING GREEN,NY,10004,Consultant,Adams Buckner,One,Battery Park Plaza,New York,NY,320,0,0,4,,,,,,,,,,,,,,,,,,N,N,
2025,5,2267,P,"Hudson, Crystal",K,4,ABC,,,R0000012,1/6/2024,,"Adams, Bryce",IND,,,,Z,Montclair,NJ,7043,Sales,Captiv8,144,Watchung ave,Montclair,NJ,100,0,0,4,,,,,,,,,,,,,,,,,,N,N,
2025,1,1545,P,"Adams, Eric L",N,1,ABC,,,R0079912,3/16/2022,,"Adams, Carol",IND,,,,Z,Chicago,IL,60649,Consultant,Self-employed,6929,S. Crandonn,Chicago,IL,2000,0,0,4,,,,,,,,,,,,,,,,,,N,N,
2025,5,2267,P,"Hudson, Crystal",K,4,ABC,,,R0000023,1/8/2024,,"Adams, Elizabeth",IND,,,,K,Brooklyn,NY,11222,Advocacy Director,Transportation Alternatives,111,"John Street, New York, NY, USA",New York,NY,100,100,0,4,,,,,,,,,,,,,,,,,,N,N,
2025,4,1707,P,"Gibson, Vanessa L",N,4,ABC,,,R0012234,11/27/2023,,"Adams, Jackie",IND,,,,M,New York,NY,10027,,NOT EMPLOYED,,,,,100,100,0,4,,,,,,,,,,,,,,,,,,N,N,
2025,1,1545,P,"Adams, Eric L",N,4,ABC,,,R0088033,9/26/2023,,"Adams, Malcolm Louis",IND,,,,K,Brooklyn,NY,11206,COMPASS,Licensed Associate Real Estate,136,North 10th Street,Brooklyn,NY,100,100,0,4,,,,,,,,,,,,,,,,,,N,N,
2025,4,311,P,"Levine, Mark",P,2,ABC,,,R0020424,1/13/2023,,"Adams, Ryan",IND,,,,Q,Forest Hills,NY,11375,Consultant,HZQ Consulting,142,west 92nd,New York,NY,18,18,0,4,,,,,,,,,,,,,,,,,,N,N,
2025,3,1164,P,"Lander, Brad",N,2,ABC,,,R0063994,11/2/2022,,"Adams, Samuel",IND,,,,K,Brooklyn,NY,11218,Attorney,Pomerantz LLP,600,Third Ave,New York,NY,250,250,0,4,,,,,,,,,,,,,,,,,,N,N,
2025,4,311,P,"Levine, Mark",P,4,ABC,,,R0022021,11/5/2023,,"Adams, Suzanne",IND,,,,M,New York,NY,10128,Judge,NYS,1725,York Avenue,New York,NY,75,75,0,4,,,,,,,,,,,,,,,,,,N,N,
2025,2,1227,P,"Williams, Jumaane D",R,4,ABC,,,R0040521,1/12/2024,,"Adamson Serieux, Ann Marie",IND,,,,K,Brooklyn,NY,11205,VP,Emblemhealth,55,Water Street,New York,NY,250,0,0,4,,,,,,,,,,,,,,,,,,N,N,
2025,4,1707,P,"Gibson, Vanessa L",N,3,ABC,,,R0010983,3/28/2023,,"Adamson, Ann Marie",IND,,,,K,Brooklyn,NY,11205,Director,Emblemhealth,368,E. 26th St,Brooklyn,NY,250,175,0,4,,,,,,,,,,,,,,,,,,N,N,
2025,5,2267,P,"Hudson, Crystal",K,4,ABC,,,R0000160,1/12/2024,,"Addison, Casie",IND,,,,K,Brooklyn,NY,11205,Chief of Staff,City of New York,55,Hanson Place,Brooklyn,NY,50,50,0,4,,,,,,,,,,,,,,,,,,N,N,
2025,4,311,P,"Levine, Mark",P,3,ABC,,,R0021012,5/14/2023,,"Addiss, Gail",IND,,,,M,New York,NY,10034,Unemployed,,,,,,50,50,0,4,,,,,,,,,,,,,,,,,,N,N,
2025,3,1164,P,"Lander, Brad",N,4,ABC,,,R0069894,1/8/2024,,"Adelman, Peter",IND,,,,K,Brooklyn,NY,11217,Attorney,Law Offices of Peter Adelman L,95,6th Ave,Brooklyn,NY,250,250,0,4,,,,,,,,,,,,,,,,,,N,N,
2025,1,1545,P,"Adams, Eric L",N,3,ABC,,,R0085571,6/15/2023,,"adelsberg, jonathan",IND,,,,M,New York,NY,10023,Attorney,Herrick Feinstein,2,Park Avenue,New York,NY,1000,250,0,4,,,,,,,,,,,,,,,,,,N,N,
2025,1,1545,P,"Adams, Eric L",N,1,ABC,,,R0079877,3/14/2022,,"Ades, Maurice",IND,,,,Z,Secaucus,NJ,7094,Real estate,Rugby realty,300,Lighting Way,New York,NY,1000,0,0,4,,,,,,,,,,,,,,,,,,N,N,
2025,5,2836,P,"Okporo, Edafe",H,4,ABC,,,R0000109,12/12/2023,,"Adewoye, John",IND,,,,Z,Riverdale,IL,60827,Social Work,Dcfs,6201,South Emerald Drive,Chicago,IL,10,0,0,4,,,,,,,,,,,,,,,,,,N,N,
2025,1,1545,P,"Adams, Eric L",N,1,ABC,,,R0080028,3/23/2022,,"Adjmi, Alex",IND,,,,Z,West Allenhurst,NJ,7711,Investor,One Step Up LtD,1412,Broadway,New York,NY,2000,0,0,4,,,,,,,,,,,,,,,,,,N,N,
2025,1,1545,P,"Adams, Eric L",N,1,ABC,,,R0082003,4/27/2022,,"Adjmi, Alex",IND,,,,Z,West Allenhurst,NJ,7711,Investor,One Step Up LtD,1412,Broadway,New York,NY,2000,0,2000,2,,,,,,,,,,,,,,,,,,N,N,
2025,1,1545,P,"Adams, Eric L",N,4,M,,,R0086878,3/23/2022,7/17/2023,"Adjmi, Alex",IND,,,,Z,West Allenhurst,NJ,7711,,,,,,,-1900,0,0,0,,,,,,,,,,,,,,,,,2,N,N,
2025,1,1545,P,"Adams, Eric L",N,1,ABC,,,R0080438,4/27/2022,,"ADJMI, ALICE",IND,,,,K,Brooklyn,NY,11223,Not Employed,Not Employed,,,,,2000,250,0,4,,,,,,,,,,,,,,,,,,N,N,
2025,1,1545,P,"Adams, Eric L",N,1,ABC,,,R0080436,4/27/2022,,"Adjmi, Harry",IND,,,,K,Brooklyn,NY,11223,Businessman,One Step Up LTD,1412,Broadway,New York,NY,2000,250,0,4,,,,,,,,,,,,,,,,,,N,N,
2025,1,1545,P,"Adams, Eric L",N,1,ABC,,,R0080037,3/23/2022,,"Adjmi, Mark",IND,,,,M,New York,NY,10018,Executive,Self,1033,East 9th Street,Brooklyn,NY,2000,250,0,4,,,,,,,,,,,,,,,,,,N,N,
2025,1,1545,P,"Adams, Eric L",N,1,ABC,,,R0080035,3/23/2022,,"Adjmi, Marqus",IND,,,,M,New York,NY,10018,Real Estate,AHCS,1412,Broadway,New York,NY,2000,250,0,4,,,,,,,,,,,,,,,,,,N,N,
2025,3,1164,P,"Lander, Brad",N,4,ABC,,,R0070851,1/11/2024,,"Adler, Denise",IND,,,,M,New York,NY,10011,Not Employed,Not Employed,177,Ninth Ave,New York,NY,50,50,0,4,,,,,,,,,,,,,,,,,,N,N,
2025,3,1164,P,"Lander, Brad",N,4,ABC,,,R0069779,1/2/2024,,"Adler, John",IND,,,,K,Brooklyn,NY,11215,Municipal employee,City of New York,1,Centre St,Manhattan,NY,250,250,0,4,,,,,,,,,,,,,,,,,,N,N,
2025,1,1545,P,"Adams, Eric L",N,1,ABC,,,R0080069,3/27/2022,,"Adler, Louis",IND,,,,M,New York,NY,10021-272,Real Estate Broker,REAL New York,164,Ludlow Street,New york,NY,2000,250,0,4,,,,,,,,,,,,,,,,,,N,N,
2025,1,1545,P,"Adams, Eric L",N,1,ABC,,,R0079996,3/22/2022,,"Adrabi, Jonathan",IND,,,,Z,Miami Shores,FL,33138,Consultant,LSN,801,Arthur Godfrey Road,Miami Beach,FL,2000,0,0,4,,,,,,,,,,,,,,,,,,N,N,
2025,4,1707,P,"Gibson, Vanessa L",N,4,ABC,,,R0012599,1/12/2024,,AFSCME Local 1407,PCOMP,,,,M,New York,NY,10007,,,,,,,500,0,0,2,,,,,,,,,,,,,,,,,,N,N,
2025,3,1164,P,"Lander, Brad",N,3,ABC,,,R0065495,2/8/2023,,AFSCME Working Families Fund,EMPO,,,,Z,Washington,DC,20036,,,,,,,2100,0,0,3,,,,,,,,,,,,,,,,,,N,N,
2025,3,1164,P,"Lander, Brad",N,4,M,,,R0069319,2/8/2023,1/2/2024,AFSCME Working Families Fund,EMPO,,,,Z,Washington,DC,20036,,,,,,,-2100,0,0,0,,,,,,,,,,,,,,,,,2,N,N,
2025,3,1164,P,"Lander, Brad",N,4,ABC,,,R0070992,1/12/2024,,"agger, marc",IND,,,,K,brooklyn,NY,11201,Director,Brooklyn Fish Transfer,5,Montague Terr,Brooklyn,NY,500,250,0,4,,,,,,,,,,,,,,,,,,N,N,
2025,4,1550,P,"Reynoso, Antonio",M,3,ABC,,,R0015970,5/30/2023,,"agger, marc",IND,,,,K,BROOKLYN,NY,11201,Business Person,Brooklyn Fish Transfer,5,Montague Terrace,Brooklyn,NY,500,175,0,4,,,,,,,,,,,,,,,,,,N,N,
2025,1,1545,P,"Adams, Eric L",N,4,ABC,,,R0088359,10/9/2023,,"Agirnasli, Murat",IND,,,,Z,Alpine,NJ,7620,Apparel Trading International,President,1373,Broad Street Suite,Clifton,NJ,1000,0,0,4,,,,,,,,,,,,,,,,,,N,N,
2025,3,1164,P,"Lander, Brad",N,4,ABC,,,R0068960,11/3/2023,,"Agosin, Barbara",IND,,,,K,Brooklyn,NY,11217,Not Employed,Not Employed,154,Lincoln Pl,Brooklyn,NY,50,50,0,4,,,,,,,,,,,,,,,,,,N,N,
2025,4,1550,P,"Reynoso, Antonio",M,3,ABC,,,R0015384,5/17/2023,,"Aguila, Mario",IND,,,,K,BROOKLYN,NY,11249,Retired,,,,,,200,0,0,4,2,"Leon, Jose",,,,Forest Hills,NY,11375,ST. NICKS ALLIANCE,2,KINGSLAND AVE,Brooklyn,NY,Director,,,,N,N,IND
2025,4,1550,P,"Reynoso, Antonio",M,3,ABC,,,R0016548,7/11/2023,,"Aguilar, Nicholas",IND,,,,Q,Jamaica,NY,11436,Deputy Press Secretary,New York City Economic Develop,1,Liberty Street,New York,NY,25,25,0,4,,,,,,,,,,,,,,,,,,N,N,
2025,1,1545,P,"Adams, Eric L",N,3,ABC,,,R0083718,4/5/2023,,"Ahluwalia, Narinder",IND,,,,Z,Roslyn,NY,11576,Self,Dunkin,61-03,Flushing Avenue,Flushing,NY,1000,0,0,4,,,,,,,,,,,,,,,,,,N,N,
2025,2,1227,P,"Williams, Jumaane D",R,4,ABC,,,R0040514,1/11/2024,,"Ahmad, Husam",IND,,,,Q,Forest Hills,NY,11375,Engineer,Infrastructure Business Adviso,35,Greenway North,Forest Hills,NY,100,0,0,4,,,,,,,,,,,,,,,,,,N,N,
2025,2,1227,P,"Williams, Jumaane D",R,3,ABC,,,R0039620,5/11/2023,,"Ahmad, Mushtaq",IND,,,,K,Brooklyn,NY,11218,,,,,,,100,100,0,1,,,,,,,,,,,,,,,,,,N,N,
2025,1,1545,P,"Adams, Eric L",N,4,ABC,,,R0088069,9/28/2023,,"Ahmed, Abdullai",IND,,,,X,Bronx,NY,10450,NEWPOSSS INC,Data Analyst,99,Wall Street,BOWLING GREEN,NY,50,50,0,4,,,,,,,,,,,,,,,,,,N,N,
2025,1,1545,P,"Adams, Eric L",N,3,ABC,,,R0085483,6/14/2023,,"Ahmed, Ali",IND,,,,K,Brooklyn,NY,11205,Manager,8 bit bites,113,court st,Brooklyn Heights,NY,2100,250,0,4,,,,,,,,,,,,,,,,,,N,N,
2025,1,1545,P,"Adams, Eric L",N,4,ABC,,,R0088423,10/15/2023,,"Ahmed, Fatema",IND,,,,Z,South Setauket,NY,11720,Patient Assistant,RF Foundation Stonybrook,4,Smith Haven Mall,Lake Grove,NY,300,0,0,2,,,,,,,,,,,,,,,,,,N,N,
2025,1,1545,P,"Adams, Eric L",N,4,ABC,,,R0087651,8/29/2023,,"Ahmed, Giash",IND,,,,Z,East Northport,NY,11731,CEO,Immigrant Elder Homecare LLC,37-05,74th street,Jackson Heights,NY,2000,0,0,4,,,,,,,,,,,,,,,,,,N,N,
2025,1,1545,P,"Adams, Eric L",N,1,ABC,,,R0082062,5/6/2022,,"Ahmed, Kazi M.",IND,,,,Q,Woodhaven,NY,11421,,,,,,,2000,250,0,2,,,,,,,,,,,,,,,,,,N,N,
2025,1,1545,P,"Adams, Eric L",N,4,ABC,,,R0088439,10/15/2023,,"Ahmed, Mahfuj",IND,,,,Z,North New Hyde Park,NY,11040,Manager,Unique Design NYC LLC,43-30,36th Street,Astoria,NY,2000,0,0,2,,,,,,,,,,,,,,,,,,N,N,
2025,1,1545,P,"Adams, Eric L",N,4,ABC,,,R0088399,10/15/2023,,"Ahmed, Mostak",IND,,,,Q,Jamaica,NY,11432,Builder,Marand Mostak INC,175-611,Hillside Ave,Jamaica,NY,2000,250,0,2,,,,,,,,,,,,,,,,,,N,N,
2025,1,1545,P,"Adams, Eric L",N,4,ABC,,,R0087653,8/29/2023,,"Ahmed, Nusrat",IND,,,,Z,East Northport,NY,11731,Manager,Immigrant Elder Homecare llc,37-05,74th street,Jackson Heights,NY,2000,0,0,4,,,,,,,,,,,,,,,,,,N,N,
2025,1,1545,P,"Adams, Eric L",N,4,ABC,,,R0087600,8/29/2023,,"Ahmed, Sayeed",IND,,,,K,Brooklyn,NY,11219,COO,Madiua,1095,Atlantic Ave,Brooklyn,NY,2000,0,0,2,,,,,,,,,,,,,,,,,,N,N,
2025,1,1545,P,"Adams, Eric L",N,4,M,,,R0089283,8/29/2023,9/28/2023,"Ahmed, Sayeed",IND,,,,K,Brooklyn,NY,11219,,,,,,,-2000,0,0,0,,,,,,,,,,,,,,,,,1,N,N,
2025,1,1545,P,"Adams, Eric L",N,4,ABC,,,R0087657,8/29/2023,,"Ahmed, Tameem",IND,,,,Z,East Northport,NY,11731,Coordinator,immigrant Elder Homecare llc,37-05,74th street,Jackson Heights,NY,1000,0,0,4,,,,,,,,,,,,,,,,,,N,N,
2025,3,1164,P,"Lander, Brad",N,2,ABC,,,R0064138,11/27/2022,,"Aibelweiss, Wendy",IND,,,,K,Brooklyn,NY,11215,Not Employed,Not Employed,,,,,200,200,0,4,,,,,,,,,,,,,,,,,,N,N,